{"text_format":"1","workbook":"xlsx","n_sheets":4,"sheets":["①基本情報（今回の研修に係る事項）","②名簿（受講者情報を入力）","※入力不要③受講証,標識","※入力不要 ④税務署提出名簿"],"not_rendered":{"charts":0,"images":0,"macros":1,"external_links":0,"defined_names":4,"comments":1,"pivot_tables":0},"unopened":[],"bounds":{"document_bytes":16777216,"sheet_cells":100000,"rows_first":2000,"rows_last":500,"rows_between":2000,"halvings":0,"cell_chars":16384,"cell_head_chars":4096},"cells_cut":0,"cells_raw":0,"read":"whole","date_system":"1900"}

{"sheet":"①基本情報（今回の研修に係る事項）","index":0,"n_rows":8,"n_cols":3,"rows_kept":8,"cut":false,"hidden":false,"merged":[]}
[null,"入力欄※黄色のセルをご入力ください。","例"]
["受講証発行日\n（研修開催日と同一）",null,"2016-04-01"]
["受講場所",null,"全国小売酒販会館 大会議室"]
["研修実施団体\n及び理事長名",null,"全国小売酒販組合中央会　会長　坂田　辰久"]
[]
["酒類販売管理研修受講年月日",null,"2016-04-01"]
["次回研修の\n有効期限※自動入力",{"$f":"IF(B6=\"\",\"\",EDATE(B6,36)-1)","v":""},"2019-03-31"]
["研修実施団体名",null,"全国小売酒販組合中央会中央会"]

{"sheet":"②名簿（受講者情報を入力）","index":1,"n_rows":152,"n_cols":19,"rows_kept":152,"cut":false,"hidden":false,"merged":[[0,0,0,3],[0,4,0,5],[0,12,0,15]]}
[{"$f":"'①基本情報（今回の研修に係る事項）'!B2","v":"00:00:00"},null,null,null,"開催 研修受講者名簿",null,null,null,null,null,null,null,"※黄色のセルの項目が入力箇所になります。"]
[null,"受講証\n番号","研修日","所管\n税務署","酒類小売業者の\n氏名または名称","販売場の名称","郵便番号","所在地","受講者氏名","フリガナ","郵便番号","自宅住所","生年月日","役職","最終受講\n年月日","最終受講時の研修実施団体名","販売場の名称","所在地","酒類販売管理者の氏名"]
[1,"第00001号","2016-04-01","恵比寿","酒販酒店","セントラルリカー恵比寿店","111-1111","東京都恵比寿1-1-1","酒　太郎",{"$f":"PHONETIC(I3)","v":"サケ　タロウ"},"666-6666","東京都町田6-6-6","1980-01-19",null,"2003-12-01","神奈川県小売酒販組合連合会",{"$f":"F3","v":"セントラルリカー恵比寿店"},{"$f":"H3","v":"東京都恵比寿1-1-1"},{"$f":"I3","v":"酒　太郎"}]
[2,"第00002号","2016-04-01","渋谷","オールジャパンリカー","ジャパンリカー渋谷ハチ公前店","222-2222","東京都渋谷2-2-2","小売　次郎",{"$f":"PHONETIC(I4)","v":"コウリ　ジロウ"},"666-6667","東京都町田6-6-7","1980-01-20",null,null,null,{"$f":"F4","v":"ジャパンリカー渋谷ハチ公前店"},{"$f":"H4","v":"東京都渋谷2-2-2"},{"$f":"I4","v":"小売　次郎"}]
[3,"第00003号","2016-04-01","品川","中央酒株式会社","ワールドワイド酒センター品川店","333-3333","東京都品川3-3-3","平山　奈緒","ヒラヤマ　ナオ","666-6668","東京都町田6-6-8","1980-01-21",null,"2014-03-05",null,"ワールドワイド酒センター品川店","東京都品川3-3-3","平山　奈緒"]
[4,"第00004号","2016-04-01","大崎","有限会社酒ジャパン","本丸壽屋酒店大崎店","444-4444","東京都大崎4-4-4","小倉　修作","オグラ　シュウサク","666-6669","東京都町田6-6-9","1980-01-22",null,null,null,"本丸壽屋酒店大崎店","東京都大崎4-4-4","小倉　修作"]
[5,"第00005号","2016-04-01","町田","株式会社フレッシュワイン","ワインのことなら！町田店","555-5555","東京都町田5-5-5","リチャード　フィッシャーマン","リチャード　フィッシャーマン","666-6670","東京都町田6-6-10","1980-01-23",null,null,null,"ワインのことなら！町田店","東京都町田5-5-5","リチャード　フィッシャーマン"]
[6]
[7]
[8]
[9]
[10]
[11]
[12]
[13]
[14]
[15]
[16]
[17]
[18]
{"$rows_left_out":133}
{"sheet":"※入力不要③受講証,標識","index":2,"n_rows":42,"n_cols":37,"rows_kept":42,"cut":false,"hidden":false,"merged":[[1,25,1,31],[2,5,2,28],[19,4,19,30],[18,3,18,19],[16,4,16,30],[15,4,15,21],[14,3,14,23],[11,3,11,23],[9,4,9,30],[7,3,7,23],[6,3,6,30],[8,4,8,30],[12,4,12,30],[41,12,44,31],[37,12,40,31],[33,12,36,31],[30,12,32,31],[25,2,28,11],[41,2,44,11],[37,2,40,11],[33,2,36,11],[27,12,28,31],[25,12,26,31],[29,2,32,11],[29,12,29,31],[22,2,23,31],[2,36,2,38],[3,36,3,38],[2,39,3,43],[5,39,7,43],[3,2,5,31]]}
[]
[null,null,null,null,null,null,null,null,null,null,null,null,null,null,null,null,null,null,null,null,null,null,null,null,null,{"$f":"VLOOKUP(AK4,'②名簿（受講者情報を入力）'!A1:V152,2,0)","v":"第00005号"}]
[null,null,null,null,null,"酒類販売管理研修受講証",null,null,null,null,null,null,null,null,null,null,null,null,null,null,null,null,null,null,null,null,null,null,null,null,null,null,null,null,null,null,"A 印刷番号"]
[null,null,"　酒税の保全及び酒類業組合等に関する法律第86条の９第１項(第6項)に規定する研修を受講した者であることを下記のとおり証する。",null,null,null,null,null,null,null,null,null,null,null,null,null,null,null,null,null,null,null,null,null,null,null,null,null,null,null,null,null,null,null,null,null,5]
[]
[]
[null,null,null,"記"]
[null,null,null,"１ 販売場の名称及び所在地"]
[null,null,null,null,{"$f":"VLOOKUP(AK4,'②名簿（受講者情報を入力）'!A1:V152,6,0)","v":"ワインのことなら！町田店"}]
[null,null,null,null,{"$f":"VLOOKUP(AK4,'②名簿（受講者情報を入力）'!A1:V152,8,0)","v":"東京都町田5-5-5"}]
[]
[null,null,null,"２ 受講者の氏名"]
[null,null,null,null,{"$f":"VLOOKUP(AK4,'②名簿（受講者情報を入力）'!A1:V152,9,0)","v":"リチャード　フィッシャーマン"}]
[]
[null,null,null,"3  酒類販売管理研修の受講年月日及び受講場所"]
[null,null,null,null,{"$f":"'①基本情報（今回の研修に係る事項）'!B2:B2","v":"00:00:00"}]
[null,null,null,null,{"$f":"'①基本情報（今回の研修に係る事項）'!B3:B3","v":0}]
[]
[null,null,null,{"$f":"E16","v":"00:00:00"}]
[null,null,null,null,{"$f":"'①基本情報（今回の研修に係る事項）'!B4:B4","v":0}]
{"$rows_left_out":23}
{"sheet":"※入力不要 ④税務署提出名簿","index":3,"n_rows":154,"n_cols":13,"rows_kept":154,"cut":false,"hidden":false,"merged":[[1,9,1,12],[2,0,2,12]]}
[null,null,null,null,null,null,null,null,null,null,null,null,"別紙15"]
[null,null,null,null,null,null,null,null,"研修実施団体の名称",{"$f":"'①基本情報（今回の研修に係る事項）'!B8","v":0}]
["酒類販売管理研修受講者名簿"]
["研修日","所管\n税務署","酒類小売業者の\n氏名または名称","販売場の名称","郵便番号","所在地","受講者氏名","郵便番号","自宅住所","生年月日","役職","研修最終受講年月日","研修実施団体の名称"]
[{"$f":"IF('②名簿（受講者情報を入力）'!C3=\"\",\"\",('②名簿（受講者情報を入力）'!C3))","v":"2016-04-01"},{"$f":"IF('②名簿（受講者情報を入力）'!D3=\"\",\"\",('②名簿（受講者情報を入力）'!D3))","v":"恵比寿"},{"$f":"IF('②名簿（受講者情報を入力）'!E3=\"\",\"\",('②名簿（受講者情報を入力）'!E3))","v":"酒販酒店"},{"$f":"IF('②名簿（受講者情報を入力）'!F3=\"\",\"\",('②名簿（受講者情報を入力）'!F3))","v":"セントラルリカー恵比寿店"},{"$f":"IF('②名簿（受講者情報を入力）'!G3=\"\",\"\",('②名簿（受講者情報を入力）'!G3))","v":"111-1111"},{"$f":"IF('②名簿（受講者情報を入力）'!H3=\"\",\"\",('②名簿（受講者情報を入力）'!H3))","v":"東京都恵比寿1-1-1"},{"$f":"IF('②名簿（受講者情報を入力）'!I3=\"\",\"\",('②名簿（受講者情報を入力）'!I3))","v":"酒　太郎"},{"$f":"IF('②名簿（受講者情報を入力）'!K3=\"\",\"\",('②名簿（受講者情報を入力）'!K3))","v":"666-6666"},{"$f":"IF('②名簿（受講者情報を入力）'!L3=\"\",\"\",('②名簿（受講者情報を入力）'!L3))","v":"東京都町田6-6-6"},{"$f":"IF('②名簿（受講者情報を入力）'!M3=\"\",\"\",('②名簿（受講者情報を入力）'!M3))","v":"1980-01-19"},{"$f":"IF('②名簿（受講者情報を入力）'!N3=\"\",\"\",('②名簿（受講者情報を入力）'!N3))","v":""},{"$f":"IF('②名簿（受講者情報を入力）'!P3=\"\",\"\",('②名簿（受講者情報を入力）'!P3))","v":"神奈川県小売酒販組合連合会"},"全国小売酒販組合中央会"]
[{"$f":"IF('②名簿（受講者情報を入力）'!C4=\"\",\"\",('②名簿（受講者情報を入力）'!C4))","v":"2016-04-01"},{"$f":"IF('②名簿（受講者情報を入力）'!D4=\"\",\"\",('②名簿（受講者情報を入力）'!D4))","v":"渋谷"},{"$f":"IF('②名簿（受講者情報を入力）'!E4=\"\",\"\",('②名簿（受講者情報を入力）'!E4))","v":"オールジャパンリカー"},{"$f":"IF('②名簿（受講者情報を入力）'!F4=\"\",\"\",('②名簿（受講者情報を入力）'!F4))","v":"ジャパンリカー渋谷ハチ公前店"},{"$f":"IF('②名簿（受講者情報を入力）'!G4=\"\",\"\",('②名簿（受講者情報を入力）'!G4))","v":"222-2222"},{"$f":"IF('②名簿（受講者情報を入力）'!H4=\"\",\"\",('②名簿（受講者情報を入力）'!H4))","v":"東京都渋谷2-2-2"},{"$f":"IF('②名簿（受講者情報を入力）'!I4=\"\",\"\",('②名簿（受講者情報を入力）'!I4))","v":"小売　次郎"},{"$f":"IF('②名簿（受講者情報を入力）'!K4=\"\",\"\",('②名簿（受講者情報を入力）'!K4))","v":"666-6667"},{"$f":"IF('②名簿（受講者情報を入力）'!L4=\"\",\"\",('②名簿（受講者情報を入力）'!L4))","v":"東京都町田6-6-7"},{"$f":"IF('②名簿（受講者情報を入力）'!M4=\"\",\"\",('②名簿（受講者情報を入力）'!M4))","v":"1980-01-20"},{"$f":"IF('②名簿（受講者情報を入力）'!N4=\"\",\"\",('②名簿（受講者情報を入力）'!N4))","v":""},{"$f":"IF('②名簿（受講者情報を入力）'!P4=\"\",\"\",('②名簿（受講者情報を入力）'!P4))","v":""}]
[{"$f":"IF('②名簿（受講者情報を入力）'!C5=\"\",\"\",('②名簿（受講者情報を入力）'!C5))","v":"2016-04-01"},{"$f":"IF('②名簿（受講者情報を入力）'!D5=\"\",\"\",('②名簿（受講者情報を入力）'!D5))","v":"品川"},{"$f":"IF('②名簿（受講者情報を入力）'!E5=\"\",\"\",('②名簿（受講者情報を入力）'!E5))","v":"中央酒株式会社"},{"$f":"IF('②名簿（受講者情報を入力）'!F5=\"\",\"\",('②名簿（受講者情報を入力）'!F5))","v":"ワールドワイド酒センター品川店"},{"$f":"IF('②名簿（受講者情報を入力）'!G5=\"\",\"\",('②名簿（受講者情報を入力）'!G5))","v":"333-3333"},{"$f":"IF('②名簿（受講者情報を入力）'!H5=\"\",\"\",('②名簿（受講者情報を入力）'!H5))","v":"東京都品川3-3-3"},{"$f":"IF('②名簿（受講者情報を入力）'!I5=\"\",\"\",('②名簿（受講者情報を入力）'!I5))","v":"平山　奈緒"},{"$f":"IF('②名簿（受講者情報を入力）'!K5=\"\",\"\",('②名簿（受講者情報を入力）'!K5))","v":"666-6668"},{"$f":"IF('②名簿（受講者情報を入力）'!L5=\"\",\"\",('②名簿（受講者情報を入力）'!L5))","v":"東京都町田6-6-8"},{"$f":"IF('②名簿（受講者情報を入力）'!M5=\"\",\"\",('②名簿（受講者情報を入力）'!M5))","v":"1980-01-21"},{"$f":"IF('②名簿（受講者情報を入力）'!N5=\"\",\"\",('②名簿（受講者情報を入力）'!N5))","v":""},{"$f":"IF('②名簿（受講者情報を入力）'!P5=\"\",\"\",('②名簿（受講者情報を入力）'!P5))","v":""}]
[{"$f":"IF('②名簿（受講者情報を入力）'!C6=\"\",\"\",('②名簿（受講者情報を入力）'!C6))","v":"2016-04-01"},{"$f":"IF('②名簿（受講者情報を入力）'!D6=\"\",\"\",('②名簿（受講者情報を入力）'!D6))","v":"大崎"},{"$f":"IF('②名簿（受講者情報を入力）'!E6=\"\",\"\",('②名簿（受講者情報を入力）'!E6))","v":"有限会社酒ジャパン"},{"$f":"IF('②名簿（受講者情報を入力）'!F6=\"\",\"\",('②名簿（受講者情報を入力）'!F6))","v":"本丸壽屋酒店大崎店"},{"$f":"IF('②名簿（受講者情報を入力）'!G6=\"\",\"\",('②名簿（受講者情報を入力）'!G6))","v":"444-4444"},{"$f":"IF('②名簿（受講者情報を入力）'!H6=\"\",\"\",('②名簿（受講者情報を入力）'!H6))","v":"東京都大崎4-4-4"},{"$f":"IF('②名簿（受講者情報を入力）'!I6=\"\",\"\",('②名簿（受講者情報を入力）'!I6))","v":"小倉　修作"},{"$f":"IF('②名簿（受講者情報を入力）'!K6=\"\",\"\",('②名簿（受講者情報を入力）'!K6))","v":"666-6669"},{"$f":"IF('②名簿（受講者情報を入力）'!L6=\"\",\"\",('②名簿（受講者情報を入力）'!L6))","v":"東京都町田6-6-9"},{"$f":"IF('②名簿（受講者情報を入力）'!M6=\"\",\"\",('②名簿（受講者情報を入力）'!M6))","v":"1980-01-22"},{"$f":"IF('②名簿（受講者情報を入力）'!N6=\"\",\"\",('②名簿（受講者情報を入力）'!N6))","v":""},{"$f":"IF('②名簿（受講者情報を入力）'!P6=\"\",\"\",('②名簿（受講者情報を入力）'!P6))","v":""}]
[{"$f":"IF('②名簿（受講者情報を入力）'!C7=\"\",\"\",('②名簿（受講者情報を入力）'!C7))","v":"2016-04-01"},{"$f":"IF('②名簿（受講者情報を入力）'!D7=\"\",\"\",('②名簿（受講者情報を入力）'!D7))","v":"町田"},{"$f":"IF('②名簿（受講者情報を入力）'!E7=\"\",\"\",('②名簿（受講者情報を入力）'!E7))","v":"株式会社フレッシュワイン"},{"$f":"IF('②名簿（受講者情報を入力）'!F7=\"\",\"\",('②名簿（受講者情報を入力）'!F7))","v":"ワインのことなら！町田店"},{"$f":"IF('②名簿（受講者情報を入力）'!G7=\"\",\"\",('②名簿（受講者情報を入力）'!G7))","v":"555-5555"},{"$f":"IF('②名簿（受講者情報を入力）'!H7=\"\",\"\",('②名簿（受講者情報を入力）'!H7))","v":"東京都町田5-5-5"},{"$f":"IF('②名簿（受講者情報を入力）'!I7=\"\",\"\",('②名簿（受講者情報を入力）'!I7))","v":"リチャード　フィッシャーマン"},{"$f":"IF('②名簿（受講者情報を入力）'!K7=\"\",\"\",('②名簿（受講者情報を入力）'!K7))","v":"666-6670"},{"$f":"IF('②名簿（受講者情報を入力）'!L7=\"\",\"\",('②名簿（受講者情報を入力）'!L7))","v":"東京都町田6-6-10"},{"$f":"IF('②名簿（受講者情報を入力）'!M7=\"\",\"\",('②名簿（受講者情報を入力）'!M7))","v":"1980-01-23"},{"$f":"IF('②名簿（受講者情報を入力）'!N7=\"\",\"\",('②名簿（受講者情報を入力）'!N7))","v":""},{"$f":"IF('②名簿（受講者情報を入力）'!P7=\"\",\"\",('②名簿（受講者情報を入力）'!P7))","v":""}]
[{"$f":"IF('②名簿（受講者情報を入力）'!C8=\"\",\"\",('②名簿（受講者情報を入力）'!C8))","v":""},{"$f":"IF('②名簿（受講者情報を入力）'!D8=\"\",\"\",('②名簿（受講者情報を入力）'!D8))","v":""},{"$f":"IF('②名簿（受講者情報を入力）'!E8=\"\",\"\",('②名簿（受講者情報を入力）'!E8))","v":""},{"$f":"IF('②名簿（受講者情報を入力）'!F8=\"\",\"\",('②名簿（受講者情報を入力）'!F8))","v":""},{"$f":"IF('②名簿（受講者情報を入力）'!G8=\"\",\"\",('②名簿（受講者情報を入力）'!G8))","v":""},{"$f":"IF('②名簿（受講者情報を入力）'!H8=\"\",\"\",('②名簿（受講者情報を入力）'!H8))","v":""},{"$f":"IF('②名簿（受講者情報を入力）'!I8=\"\",\"\",('②名簿（受講者情報を入力）'!I8))","v":""},{"$f":"IF('②名簿（受講者情報を入力）'!K8=\"\",\"\",('②名簿（受講者情報を入力）'!K8))","v":""},{"$f":"IF('②名簿（受講者情報を入力）'!L8=\"\",\"\",('②名簿（受講者情報を入力）'!L8))","v":""},{"$f":"IF('②名簿（受講者情報を入力）'!M8=\"\",\"\",('②名簿（受講者情報を入力）'!M8))","v":""},{"$f":"IF('②名簿（受講者情報を入力）'!N8=\"\",\"\",('②名簿（受講者情報を入力）'!N8))","v":""},{"$f":"IF('②名簿（受講者情報を入力）'!P8=\"\",\"\",('②名簿（受講者情報を入力）'!P8))","v":""}]
[{"$f":"IF('②名簿（受講者情報を入力）'!C9=\"\",\"\",('②名簿（受講者情報を入力）'!C9))","v":""},{"$f":"IF('②名簿（受講者情報を入力）'!D9=\"\",\"\",('②名簿（受講者情報を入力）'!D9))","v":""},{"$f":"IF('②名簿（受講者情報を入力）'!E9=\"\",\"\",('②名簿（受講者情報を入力）'!E9))","v":""},{"$f":"IF('②名簿（受講者情報を入力）'!F9=\"\",\"\",('②名簿（受講者情報を入力）'!F9))","v":""},{"$f":"IF('②名簿（受講者情報を入力）'!G9=\"\",\"\",('②名簿（受講者情報を入力）'!G9))","v":""},{"$f":"IF('②名簿（受講者情報を入力）'!H9=\"\",\"\",('②名簿（受講者情報を入力）'!H9))","v":""},{"$f":"IF('②名簿（受講者情報を入力）'!I9=\"\",\"\",('②名簿（受講者情報を入力）'!I9))","v":""},{"$f":"IF('②名簿（受講者情報を入力）'!K9=\"\",\"\",('②名簿（受講者情報を入力）'!K9))","v":""},{"$f":"IF('②名簿（受講者情報を入力）'!L9=\"\",\"\",('②名簿（受講者情報を入力）'!L9))","v":""},{"$f":"IF('②名簿（受講者情報を入力）'!M9=\"\",\"\",('②名簿（受講者情報を入力）'!M9))","v":""},{"$f":"IF('②名簿（受講者情報を入力）'!N9=\"\",\"\",('②名簿（受講者情報を入力）'!N9))","v":""},{"$f":"IF('②名簿（受講者情報を入力）'!P9=\"\",\"\",('②名簿（受講者情報を入力）'!P9))","v":""}]
[{"$f":"IF('②名簿（受講者情報を入力）'!C10=\"\",\"\",('②名簿（受講者情報を入力）'!C10))","v":""},{"$f":"IF('②名簿（受講者情報を入力）'!D10=\"\",\"\",('②名簿（受講者情報を入力）'!D10))","v":""},{"$f":"IF('②名簿（受講者情報を入力）'!E10=\"\",\"\",('②名簿（受講者情報を入力）'!E10))","v":""},{"$f":"IF('②名簿（受講者情報を入力）'!F10=\"\",\"\",('②名簿（受講者情報を入力）'!F10))","v":""},{"$f":"IF('②名簿（受講者情報を入力）'!G10=\"\",\"\",('②名簿（受講者情報を入力）'!G10))","v":""},{"$f":"IF('②名簿（受講者情報を入力）'!H10=\"\",\"\",('②名簿（受講者情報を入力）'!H10))","v":""},{"$f":"IF('②名簿（受講者情報を入力）'!I10=\"\",\"\",('②名簿（受講者情報を入力）'!I10))","v":""},{"$f":"IF('②名簿（受講者情報を入力）'!K10=\"\",\"\",('②名簿（受講者情報を入力）'!K10))","v":""},{"$f":"IF('②名簿（受講者情報を入力）'!L10=\"\",\"\",('②名簿（受講者情報を入力）'!L10))","v":""},{"$f":"IF('②名簿（受講者情報を入力）'!M10=\"\",\"\",('②名簿（受講者情報を入力）'!M10))","v":""},{"$f":"IF('②名簿（受講者情報を入力）'!N10=\"\",\"\",('②名簿（受講者情報を入力）'!N10))","v":""},{"$f":"IF('②名簿（受講者情報を入力）'!P10=\"\",\"\",('②名簿（受講者情報を入力）'!P10))","v":""}]
[{"$f":"IF('②名簿（受講者情報を入力）'!C11=\"\",\"\",('②名簿（受講者情報を入力）'!C11))","v":""},{"$f":"IF('②名簿（受講者情報を入力）'!D11=\"\",\"\",('②名簿（受講者情報を入力）'!D11))","v":""},{"$f":"IF('②名簿（受講者情報を入力）'!E11=\"\",\"\",('②名簿（受講者情報を入力）'!E11))","v":""},{"$f":"IF('②名簿（受講者情報を入力）'!F11=\"\",\"\",('②名簿（受講者情報を入力）'!F11))","v":""},{"$f":"IF('②名簿（受講者情報を入力）'!G11=\"\",\"\",('②名簿（受講者情報を入力）'!G11))","v":""},{"$f":"IF('②名簿（受講者情報を入力）'!H11=\"\",\"\",('②名簿（受講者情報を入力）'!H11))","v":""},{"$f":"IF('②名簿（受講者情報を入力）'!I11=\"\",\"\",('②名簿（受講者情報を入力）'!I11))","v":""},{"$f":"IF('②名簿（受講者情報を入力）'!K11=\"\",\"\",('②名簿（受講者情報を入力）'!K11))","v":""},{"$f":"IF('②名簿（受講者情報を入力）'!L11=\"\",\"\",('②名簿（受講者情報を入力）'!L11))","v":""},{"$f":"IF('②名簿（受講者情報を入力）'!M11=\"\",\"\",('②名簿（受講者情報を入力）'!M11))","v":""},{"$f":"IF('②名簿（受講者情報を入力）'!N11=\"\",\"\",('②名簿（受講者情報を入力）'!N11))","v":""},{"$f":"IF('②名簿（受講者情報を入力）'!P11=\"\",\"\",('②名簿（受講者情報を入力）'!P11))","v":""}]
[{"$f":"IF('②名簿（受講者情報を入力）'!C12=\"\",\"\",('②名簿（受講者情報を入力）'!C12))","v":""},{"$f":"IF('②名簿（受講者情報を入力）'!D12=\"\",\"\",('②名簿（受講者情報を入力）'!D12))","v":""},{"$f":"IF('②名簿（受講者情報を入力）'!E12=\"\",\"\",('②名簿（受講者情報を入力）'!E12))","v":""},{"$f":"IF('②名簿（受講者情報を入力）'!F12=\"\",\"\",('②名簿（受講者情報を入力）'!F12))","v":""},{"$f":"IF('②名簿（受講者情報を入力）'!G12=\"\",\"\",('②名簿（受講者情報を入力）'!G12))","v":""},{"$f":"IF('②名簿（受講者情報を入力）'!H12=\"\",\"\",('②名簿（受講者情報を入力）'!H12))","v":""},{"$f":"IF('②名簿（受講者情報を入力）'!I12=\"\",\"\",('②名簿（受講者情報を入力）'!I12))","v":""},{"$f":"IF('②名簿（受講者情報を入力）'!K12=\"\",\"\",('②名簿（受講者情報を入力）'!K12))","v":""},{"$f":"IF('②名簿（受講者情報を入力）'!L12=\"\",\"\",('②名簿（受講者情報を入力）'!L12))","v":""},{"$f":"IF('②名簿（受講者情報を入力）'!M12=\"\",\"\",('②名簿（受講者情報を入力）'!M12))","v":""},{"$f":"IF('②名簿（受講者情報を入力）'!N12=\"\",\"\",('②名簿（受講者情報を入力）'!N12))","v":""},{"$f":"IF('②名簿（受講者情報を入力）'!P12=\"\",\"\",('②名簿（受講者情報を入力）'!P12))","v":""}]
[{"$f":"IF('②名簿（受講者情報を入力）'!C13=\"\",\"\",('②名簿（受講者情報を入力）'!C13))","v":""},{"$f":"IF('②名簿（受講者情報を入力）'!D13=\"\",\"\",('②名簿（受講者情報を入力）'!D13))","v":""},{"$f":"IF('②名簿（受講者情報を入力）'!E13=\"\",\"\",('②名簿（受講者情報を入力）'!E13))","v":""},{"$f":"IF('②名簿（受講者情報を入力）'!F13=\"\",\"\",('②名簿（受講者情報を入力）'!F13))","v":""},{"$f":"IF('②名簿（受講者情報を入力）'!G13=\"\",\"\",('②名簿（受講者情報を入力）'!G13))","v":""},{"$f":"IF('②名簿（受講者情報を入力）'!H13=\"\",\"\",('②名簿（受講者情報を入力）'!H13))","v":""},{"$f":"IF('②名簿（受講者情報を入力）'!I13=\"\",\"\",('②名簿（受講者情報を入力）'!I13))","v":""},{"$f":"IF('②名簿（受講者情報を入力）'!K13=\"\",\"\",('②名簿（受講者情報を入力）'!K13))","v":""},{"$f":"IF('②名簿（受講者情報を入力）'!L13=\"\",\"\",('②名簿（受講者情報を入力）'!L13))","v":""},{"$f":"IF('②名簿（受講者情報を入力）'!M13=\"\",\"\",('②名簿（受講者情報を入力）'!M13))","v":""},{"$f":"IF('②名簿（受講者情報を入力）'!N13=\"\",\"\",('②名簿（受講者情報を入力）'!N13))","v":""},{"$f":"IF('②名簿（受講者情報を入力）'!P13=\"\",\"\",('②名簿（受講者情報を入力）'!P13))","v":""}]
[{"$f":"IF('②名簿（受講者情報を入力）'!C14=\"\",\"\",('②名簿（受講者情報を入力）'!C14))","v":""},{"$f":"IF('②名簿（受講者情報を入力）'!D14=\"\",\"\",('②名簿（受講者情報を入力）'!D14))","v":""},{"$f":"IF('②名簿（受講者情報を入力）'!E14=\"\",\"\",('②名簿（受講者情報を入力）'!E14))","v":""},{"$f":"IF('②名簿（受講者情報を入力）'!F14=\"\",\"\",('②名簿（受講者情報を入力）'!F14))","v":""},{"$f":"IF('②名簿（受講者情報を入力）'!G14=\"\",\"\",('②名簿（受講者情報を入力）'!G14))","v":""},{"$f":"IF('②名簿（受講者情報を入力）'!H14=\"\",\"\",('②名簿（受講者情報を入力）'!H14))","v":""},{"$f":"IF('②名簿（受講者情報を入力）'!I14=\"\",\"\",('②名簿（受講者情報を入力）'!I14))","v":""},{"$f":"IF('②名簿（受講者情報を入力）'!K14=\"\",\"\",('②名簿（受講者情報を入力）'!K14))","v":""},{"$f":"IF('②名簿（受講者情報を入力）'!L14=\"\",\"\",('②名簿（受講者情報を入力）'!L14))","v":""},{"$f":"IF('②名簿（受講者情報を入力）'!M14=\"\",\"\",('②名簿（受講者情報を入力）'!M14))","v":""},{"$f":"IF('②名簿（受講者情報を入力）'!N14=\"\",\"\",('②名簿（受講者情報を入力）'!N14))","v":""},{"$f":"IF('②名簿（受講者情報を入力）'!P14=\"\",\"\",('②名簿（受講者情報を入力）'!P14))","v":""}]
[{"$f":"IF('②名簿（受講者情報を入力）'!C15=\"\",\"\",('②名簿（受講者情報を入力）'!C15))","v":""},{"$f":"IF('②名簿（受講者情報を入力）'!D15=\"\",\"\",('②名簿（受講者情報を入力）'!D15))","v":""},{"$f":"IF('②名簿（受講者情報を入力）'!E15=\"\",\"\",('②名簿（受講者情報を入力）'!E15))","v":""},{"$f":"IF('②名簿（受講者情報を入力）'!F15=\"\",\"\",('②名簿（受講者情報を入力）'!F15))","v":""},{"$f":"IF('②名簿（受講者情報を入力）'!G15=\"\",\"\",('②名簿（受講者情報を入力）'!G15))","v":""},{"$f":"IF('②名簿（受講者情報を入力）'!H15=\"\",\"\",('②名簿（受講者情報を入力）'!H15))","v":""},{"$f":"IF('②名簿（受講者情報を入力）'!I15=\"\",\"\",('②名簿（受講者情報を入力）'!I15))","v":""},{"$f":"IF('②名簿（受講者情報を入力）'!K15=\"\",\"\",('②名簿（受講者情報を入力）'!K15))","v":""},{"$f":"IF('②名簿（受講者情報を入力）'!L15=\"\",\"\",('②名簿（受講者情報を入力）'!L15))","v":""},{"$f":"IF('②名簿（受講者情報を入力）'!M15=\"\",\"\",('②名簿（受講者情報を入力）'!M15))","v":""},{"$f":"IF('②名簿（受講者情報を入力）'!N15=\"\",\"\",('②名簿（受講者情報を入力）'!N15))","v":""},{"$f":"IF('②名簿（受講者情報を入力）'!P15=\"\",\"\",('②名簿（受講者情報を入力）'!P15))","v":""}]
[{"$f":"IF('②名簿（受講者情報を入力）'!C16=\"\",\"\",('②名簿（受講者情報を入力）'!C16))","v":""},{"$f":"IF('②名簿（受講者情報を入力）'!D16=\"\",\"\",('②名簿（受講者情報を入力）'!D16))","v":""},{"$f":"IF('②名簿（受講者情報を入力）'!E16=\"\",\"\",('②名簿（受講者情報を入力）'!E16))","v":""},{"$f":"IF('②名簿（受講者情報を入力）'!F16=\"\",\"\",('②名簿（受講者情報を入力）'!F16))","v":""},{"$f":"IF('②名簿（受講者情報を入力）'!G16=\"\",\"\",('②名簿（受講者情報を入力）'!G16))","v":""},{"$f":"IF('②名簿（受講者情報を入力）'!H16=\"\",\"\",('②名簿（受講者情報を入力）'!H16))","v":""},{"$f":"IF('②名簿（受講者情報を入力）'!I16=\"\",\"\",('②名簿（受講者情報を入力）'!I16))","v":""},{"$f":"IF('②名簿（受講者情報を入力）'!K16=\"\",\"\",('②名簿（受講者情報を入力）'!K16))","v":""},{"$f":"IF('②名簿（受講者情報を入力）'!L16=\"\",\"\",('②名簿（受講者情報を入力）'!L16))","v":""},{"$f":"IF('②名簿（受講者情報を入力）'!M16=\"\",\"\",('②名簿（受講者情報を入力）'!M16))","v":""},{"$f":"IF('②名簿（受講者情報を入力）'!N16=\"\",\"\",('②名簿（受講者情報を入力）'!N16))","v":""},{"$f":"IF('②名簿（受講者情報を入力）'!P16=\"\",\"\",('②名簿（受講者情報を入力）'!P16))","v":""}]
[{"$f":"IF('②名簿（受講者情報を入力）'!C17=\"\",\"\",('②名簿（受講者情報を入力）'!C17))","v":""},{"$f":"IF('②名簿（受講者情報を入力）'!D17=\"\",\"\",('②名簿（受講者情報を入力）'!D17))","v":""},{"$f":"IF('②名簿（受講者情報を入力）'!E17=\"\",\"\",('②名簿（受講者情報を入力）'!E17))","v":""},{"$f":"IF('②名簿（受講者情報を入力）'!F17=\"\",\"\",('②名簿（受講者情報を入力）'!F17))","v":""},{"$f":"IF('②名簿（受講者情報を入力）'!G17=\"\",\"\",('②名簿（受講者情報を入力）'!G17))","v":""},{"$f":"IF('②名簿（受講者情報を入力）'!H17=\"\",\"\",('②名簿（受講者情報を入力）'!H17))","v":""},{"$f":"IF('②名簿（受講者情報を入力）'!I17=\"\",\"\",('②名簿（受講者情報を入力）'!I17))","v":""},{"$f":"IF('②名簿（受講者情報を入力）'!K17=\"\",\"\",('②名簿（受講者情報を入力）'!K17))","v":""},{"$f":"IF('②名簿（受講者情報を入力）'!L17=\"\",\"\",('②名簿（受講者情報を入力）'!L17))","v":""},{"$f":"IF('②名簿（受講者情報を入力）'!M17=\"\",\"\",('②名簿（受講者情報を入力）'!M17))","v":""},{"$f":"IF('②名簿（受講者情報を入力）'!N17=\"\",\"\",('②名簿（受講者情報を入力）'!N17))","v":""},{"$f":"IF('②名簿（受講者情報を入力）'!P17=\"\",\"\",('②名簿（受講者情報を入力）'!P17))","v":""}]
[{"$f":"IF('②名簿（受講者情報を入力）'!C18=\"\",\"\",('②名簿（受講者情報を入力）'!C18))","v":""},{"$f":"IF('②名簿（受講者情報を入力）'!D18=\"\",\"\",('②名簿（受講者情報を入力）'!D18))","v":""},{"$f":"IF('②名簿（受講者情報を入力）'!E18=\"\",\"\",('②名簿（受講者情報を入力）'!E18))","v":""},{"$f":"IF('②名簿（受講者情報を入力）'!F18=\"\",\"\",('②名簿（受講者情報を入力）'!F18))","v":""},{"$f":"IF('②名簿（受講者情報を入力）'!G18=\"\",\"\",('②名簿（受講者情報を入力）'!G18))","v":""},{"$f":"IF('②名簿（受講者情報を入力）'!H18=\"\",\"\",('②名簿（受講者情報を入力）'!H18))","v":""},{"$f":"IF('②名簿（受講者情報を入力）'!I18=\"\",\"\",('②名簿（受講者情報を入力）'!I18))","v":""},{"$f":"IF('②名簿（受講者情報を入力）'!K18=\"\",\"\",('②名簿（受講者情報を入力）'!K18))","v":""},{"$f":"IF('②名簿（受講者情報を入力）'!L18=\"\",\"\",('②名簿（受講者情報を入力）'!L18))","v":""},{"$f":"IF('②名簿（受講者情報を入力）'!M18=\"\",\"\",('②名簿（受講者情報を入力）'!M18))","v":""},{"$f":"IF('②名簿（受講者情報を入力）'!N18=\"\",\"\",('②名簿（受講者情報を入力）'!N18))","v":""},{"$f":"IF('②名簿（受講者情報を入力）'!P18=\"\",\"\",('②名簿（受講者情報を入力）'!P18))","v":""}]
{"$rows_left_out":134}